Home > No Such > Boost/format.hpp' File Not Found

Boost/format.hpp' File Not Found

Contents

You signed out in another tab or window. What is a type system? Is there any job that can't be automated? In the United States is racial, ethnic, or national preference an acceptable hiring practice for departments or companies in some situations? http://bashprofile.net/no-such/boost-bzlib-h-no-such-file-or-directory.html

Did Obama call for online "truthiness tests" to "curate" news on the internet? Report a bug This report contains Public information Edit Everyone can see this information. UbuntuCommunityAsk!DeveloperDesignDiscourseHardwareInsightsJujuShopMore ›AppsHelpForumLaunchpadMAASCanonical current community chat Ask Ubuntu Ask Ubuntu Meta your communities Sign up or log in to customize your list. Ask Ubuntu works best with JavaScript enabled

Boost/format.hpp' File Not Found

Skip to content Ignore Learn more Please note that GitHub no longer supports old versions of Firefox. I'll be releasing 0.19 here in the next day or so. yes > checking for the Boost program_options library...

  • With the passing of Thai King Bhumibol, are there any customs/etiquette as a traveler I should be aware of?
  • error: command 'x86_64-linux-gnu-gcc' failed with exit status 1 Is there anything I can do to fix this?
  • Additionally you will have to link in the filesystem library, so you want FIND_PACKAGE(Boost COMPONENTS filesystem REQUIRED) for later use of target_link_libraries(mytarget ${Boost_FILESYSTEM_LIBRARY}) Enter cmake --help-module FindBoost at the shell to
  • It's a bit more modern.
  • olsgaard commented Jun 21, 2016 Thank you for your quick response.
  • That is why it said no package is installed the second time.
  • WWMay 26th, 2007, 07:29 PMThe library object files are in /usr/lib.
  • yes checking for boost/program_options.hpp...

Transform an array to another array by shifting value to adjacent element Make all the statements true Cyberpunk story: Black samurai, skateboarding courier, Mafia selling pizza and Sumerian goddess as a Browse other questions tagged compiling qt make bitcoin boost or ask your own question. I just edited my previous post. Download Boost Library How should I interpret "English is poor" review when I used a language check service before submission?

Replace lines matching a pattern with lines from another file in order Does the recent news of "ten times more galaxies" imply that there is substantially more mass? Boost Process.hpp Missing EvenSt-ring C ode - g ol!f This riddle could be extremely useful Did Sputnik 1 have attitude control? ls -l /usr/include/boost/thread* yinglcs2May 26th, 2007, 02:55 AMThere is /usr/include/boost, but there is not /usr/include/boost/thread I tried "sudo apt-get install libboost-thread-dev", but it said no package is available. $ sudo apt-get http://stackoverflow.com/questions/1065011/why-is-this-boost-header-file-not-included And if boost is only needed for gearadmin, i would really like to disable it in order to keep gearman small and simple.

If Dumbledore is the most powerful wizard (allegedly), why would he work at a glorified boarding school? Install Boost On Mac Not the answer you're looking for? What kind of bicycle clamps are these? more stack exchange communities company blog Stack Exchange Inbox Reputation and Badges sign up log in tour help Tour Start here for a quick overview of the site Help Center Detailed

Boost Process.hpp Missing

Otherwise, how can I specify where is the boost_thread library for linking? https://bugs.launchpad.net/bugs/734440 It requires the boost libraries. Boost/format.hpp' File Not Found Related 0Problem linking c++ code using boost with mingw3nuwen MinGW + Boost- error linking boost_regex7Error building Boost 1.49.0 with GCC 4.7.01Linking Boost libs in CodeBlocks (using MinGW)2Installing Boost libraries with MinGW Boost/noncopyable.hpp: No Such File Or Directory error: command '/usr/bin/gcc-4.9' failed with exit status 1 make: *** [pycnn.so] Error 1 Note that I have installed boost_1_60_0 under my home directory (I also created a link named 'boost' to

Done Building dependency tree Reading state information... check over here Which day of the week is today? Why are empty blocks not all the same size? python setup.py build_ext --inplace running build_ext skipping 'pycnn.cpp' Cython extension (up-to-date) building 'pycnn' extension /usr/bin/gcc-4.9 -fno-strict-aliasing -DNDEBUG -g -fwrapv -O2 -Wall -Wstrict-prototypes -fPIC -I/home/lavelli/cnn -I/home/lavelli/eigen-eigen-774d70b529d6 -I/usr/include/python2.7 -c pycnn.cpp -o build/temp.linux-x86_64-2.7/pycnn.o -std=c++11 Boost Thread Hpp No Such File Or Directory

How to cope with too slow Wi-Fi at hotel? asked 5 years ago viewed 13519 times active 2 years ago Get the weekly newsletter! Personal Open source Business Explore Sign up Sign in Pricing Blog Support Search GitHub This repository Watch 170 Star 1,483 Fork 198 spotify/annoy Code Issues 13 Pull requests 2 Projects his comment is here When installing pyCNN (as specified in https://github.com/clab/cnn/blob/master/INSTALL.md), I encounter a problem when I perform 'make' (after customizing setup.py).

Sign in to comment Contact GitHub API Training Shop Blog About © 2016 GitHub, Inc. Linux Install Boost But can you please tell me if I need to setup the LD_LIBRARY_PATH in my .bashrc? Sed replace specific line in file What's the most recent specific historical element that is common between Star Trek and the real world?

Why should be only a file not linked...

Skip to content Ignore Learn more Please note that GitHub no longer supports old versions of Firefox. When I open my project and try to compile it, I get this error: fatal error: boost/algorithm/string.hpp: No such file or directory| At this part of one of my header files: [email protected]:~/dogecoin$ [email protected]:~/dogecoin$ apt-cache search libboost1.53-all-dev [email protected]:~/dogecoin$ [email protected]:~/dogecoin$ sudo apt-get install libboost-all-dev Reading package lists... Brew Install Boost How?

share|improve this answer answered Jun 30 '09 at 18:22 scvalex 8,13622140 6 All headers files in boost do their includes like #include , so if doesn't work, nothing works! How do I help minimize interruptions during group meetings as a student? What does this command show? http://bashprofile.net/no-such/qapplication-no-such-file-or-directory-qt5.html Have you?

Join them; it only takes a minute: Sign up Boost lib appears to be missing hpp files? How to deal with players rejecting the question premise Does it matter which side up a seed is planted? Even if the previous steps seem ok, when I run ' make', an error is issued: make cp ../build/cnn/libcnn_shared.so . Terms Privacy Security Status Help You can't perform that action at this time.

You must first enable the Universe repository. asked 7 years ago viewed 21189 times active 3 months ago Linked 3 Boost include headers not found using cmake Related 883Why can templates only be implemented in the header file?24How Assuming you downloaded Boost 1.47.0 your path should contain the location to your Boost installation up to the boost_1_47_0 directory, but leaving out the boost one, e.g. /path/to/boost/boost_1_47_0 and not /path/to/boost/boost_1_47_0/boost Do i need anything else?

asked 2 years ago viewed 396 times active 2 years ago Related 13undefined reference to `boost::program_options::options_description::m_default_line_length'0Compiling with Boost broken in Ubuntu 12.041Installation of boost on Linux/Ubuntu2C++ Boost library geometry.hpp0Install boost version My project used an older version of Boost previously but I doubt that's an issue. that seems to help now I get a boost error at compile time. You signed out in another tab or window.

If you need more information I'm happy to provide it c++ boost cmake compilation share|improve this question edited Jun 30 '09 at 18:44 asked Jun 30 '09 at 17:41 Janusz 82.9k87255325 The compiler gives me following Error: error: boost/filesystem.hpp: No such file or directory The line that triggers the error is the following: #include "boost/filesystem.hpp" or #include Which of the above Did Sputnik 1 have attitude control? Reload to refresh your session.

Browse other questions tagged ubuntu boost compilation ubuntu-12.04 or ask your own question. share|improve this answer answered Sep 3 '12 at 2:00 Rapptz 14.4k34972 I've gone through all the processes here as far as possible but the result seems the same. –Matthew Instructions noting such have been added to README.md in the v2 branch. A search of my hard drive reveals no such files as resource.h, headers.h, etc. –David Perry Aug 15 '11 at 18:46 add a comment| 2 Answers 2 active oldest votes up

But when I compile this simple program, i can't find 'thread.hpp', can you please tell me why? #include #include void hello() { std::cout << "Hello world, I'm a thread!" I'm not sure how difficult it is to debug this problem with this limited information so if there's anything else I can provide please let me know.