Home > No Such > Boost Bzlib.h No Such File Or Directory

Boost Bzlib.h No Such File Or Directory

Contents

Backing up existing Boost.Build configuration in project-config.jam.3 Generating Boost.Build configuration in project-config.jam... gcc.compile.c++ bin.v2/libs/iostreams/build/gcc-4.1.2/release/link-static/threading-multi/bzip2.o gcc.archive bin.v2/libs/iostreams/build/gcc-4.1.2/release/link-static/threading-multi/libboost_iostreams.a common.copy /home/admin/CASAVA-1.7.0-build/opt/bootstrap/lib/libboost_iostreams.a ...updated 4 targets... If you need to reset your password, click here. gcc.compile.c++ bin.v2/libs/iostreams/build/gcc-4.1.2/release/link-static/threading-multi/bzip2.o libs/iostreams/src/bzip2.cpp:19:56: error: bzlib.h: No such file or directory libs/iostreams/src/bzip2.cpp:30: error: BZ_OK was not declared in this scope libs/iostreams/src/bzip2.cpp:31: error: BZ_RUN_OK was not declared in this scope libs/iostreams/src/bzip2.cpp:32: error: BZ_FLUSH_OK http://bashprofile.net/no-such/boost-format-hpp-39-file-not-found.html

I installed all the dependencies mentioned here: ​http://wiki.openstreetmap.org/wiki/Nominatim/Installation Im running on Ubuntu 10.10 with 2.6.35-32-generic. tools/jam/src/bin.linuxx86/bjam Unicode/ICU support for Boost.Regex?... also added the --layout=system option to bjam command line. tools/jam/src/bin.linuxx86/bjam Unicode/ICU support for Boost.Regex?... http://askubuntu.com/questions/168053/how-to-install-all-the-boost-development-libraries

Boost Bzlib.h No Such File Or Directory

Like they did for Fedora some time ago. /etc/yum.repos.d/epel.repo : You can uncomment the line "mirrorlist .." with a hashmark ( # ). What does a well diversified self-managed investment portfolio look like? Must be a very old OS ?

Further information: - Command line help: ./bjam --help - Getting started guide: http://www.boost.org/more/getting_started/unix-variants.html - Boost.Build documentation: http://www.boost.org/boost-build2/doc/html/index.html warning: Building Boost.Regex with the optional Unicode/ICU support disabled. Couldn't configure the project: /home/admin/CASAVA-1.7.0-build/bootstrap/bin/cmake -H"/home/admin/CASAVA_v1.7.0/src" -B"/home/admin/CASAVA-1.7.0-build" -G"Unix Makefiles" -DCASAVA_PREFIX:PATH= -DCASAVA_EXEC_PREFIX:PATH= -DCMAKE_INSTALL_PREFIX:PATH= -DCASAVA_BINDIR:PATH= -DCASAVA_LIBDIR:PATH= -DCASAVA_LIBEXECDIR:PATH= -DCASAVA_INCLUDEDIR:PATH= -DCASAVA_DATADIR:PATH= -DCASAVA_DOCDIR:PATH= -DCASAVA_MANDIR:PATH= -DCMAKE_BUILD_TYPE:STRING=RelWithDebInfo Moving CMakeCache.txt to CMakeCache.txt.removed waiting for help...thanks in advance! But then a short time later during the compile, screens full of errors appear. Fatal Error No Such File Or Directory Arduino Decompressing /home/admin/CASAVA_v1.7.0/src/../redist/boost_1_41_0.tar.gz Building Boost.Jam with toolset gcc...

Paula Adv Reply February 7th, 2012 #2 oldos2er View Profile View Forum Posts Private Message Happy Halloween! Fatal Error No Such File Or Directory C++ Reverting the changes to the Jam files allows using the custom zlib version again. Please specify the include file location using the following option: --bz2-includes=DIR I have the development files and the debug files (just in case) and have ran apt-file search which returns: Code: http://stackoverflow.com/questions/3829421/installing-latest-1-44-boost-library-under-ubuntu-10-04 The rule is one function - one .cmake file with the same name so you can easily verify that your module used by simple ctrl+F (or * if you are GVim

I've tried the documentation but it still seems beyond me. Fatal Error No Such File Or Directory Gcc Is there a role with more responsibility? So (and hopefully someone comes along with a less clunky, more elegant solution), you can try to install all of the libbz2 packages in the repos: Code: sudo apt-get install libbz2-1.0 up vote 37 down vote favorite 7 I am having trouble installing boost library completely it fails/skips several things that seem to be key for me to continue on to compiling

Fatal Error No Such File Or Directory C++

The following bjam succeeds if you remove these two lines added by this patch. Terms Privacy Security Status Help You can't perform that action at this time. Boost Bzlib.h No Such File Or Directory Will try linking tomorrow... –Matt Sep 30 '10 at 10:15 add a comment| 2 Answers 2 active oldest votes up vote 33 down vote accepted What you miss here is bz2 Fatal Error No Such File Or Directory Codeblocks I will fix this, but it may not make it into 1.56.

Code: Looking for includes and libraries: Checking for bzlib.h: /usr/lib/ghc-7.0.3/haddock/bzlib-0.5.0.1 (user supplied, but seems not to work) bzlib.h not found. http://bashprofile.net/no-such/ft2build-h-no-such-file-or-directory.html The mortgage company is trying to force us to make repairs after an insurance claim What is a type system? comment:8 Changed 21 months ago by anonymous Under Ubuntu 14.04.1 LTS, this is the output of trying to build Boost 1.57 iostreams without zlib and WITHOUT specifying NO_COMPRESSION or NO_ZLIB: Performing On Mon, 22 Oct 2012 16:39:42 +0100 Richard Purdie wrote: > On Sat, 2012-10-20 at 17:50 +0200, Denis 'GNUtoo' Carikli wrote: > > This patch is needed for making wesnoth(will Fatal Error No Such File Or Directory Compilation Terminated

i.e. For my use-case the whole application and dependencies (including boost) are statically linked so I have to prevent trying to link multiple versions of it when zlib is used elsewhere. Owner ruslo commented Apr 26, 2015 Yes, you can use HUNTER_Boost_CMAKE_ARGS variable, just note that it is set using configure_file command, so in template scheme it need to have @: message("HUNTER_Boost_CMAKE_ARGS: navigate here The time now is 08:56 AM.

Adv Reply February 7th, 2012 #4 satanselbow View Profile View Forum Posts Private Message Dipped in Ubuntu Join Date Oct 2009 Location Upminster, Essex, UK Beans 544 Re: Compiling dvdistaster: Fatal Error No Such File Or Directory Iostream Install this library first using the following command - sudo apt-get install libbz2-dev. It appears to me it is impossible to build iostreams without zlib support as it is.

Posts: 16,276 Rep: #4 Quote: error: bzlib.h: No such file or directory # yum install bzip2-devel 1 members found this post helpful.

  1. Try sudo apt-get install libbz2-dev comment:2 Changed 5 years ago by datendelphin Resolution set to fixed Status changed from new to closed Added dependency on wiki page.
  2. comment:4 Changed 2 years ago by anonymous We also observed this problem when switching to Boost 1.56 comment:5 Changed 2 years ago by anonymous On Boost 1.56 (current release), building without
  3. I am using boost 1.59.
  4. I think what I had to do (after basically installing every variant of libbz2 available in the repos!) was manually download and compile bzip2, and then reboot the system so that
  5. Didier Spaier View Public Profile View LQ Blog View Review Entries View HCL Entries View LQ Wiki Contributions Visit Didier Spaier's homepage!
  6. Bootstrapping is done.
  7. boost-1_41_0 installed successfully -- Successfuly built boost 1.41.0 from the distribution package... -- Installing Post-Run Command Framework -- Check if the system is big endian -- Searching 16 bit integer --
  8. I did find some .a files scattered around though.
  9. it was able to install boost after installing bzip2-devel but the CASAVA install failed this time with different error.
  10. Changed by anonymous Modify Ticket Change Properties Summary: Type: BugsFeature RequestsPatchesSupport RequestsTasksLibrary Submissions Milestone: Boost 1.55.0 Boost 1.61.0Boost 1.62.0Boost 1.63.0 Boost.Jam 4.0.0To Be DeterminedWebsite 1.X Component: Building BoostDocumentationGILGetting Started GuideICLNoneRegression Testing

See examples: issue 24, issue 107. By joining our community you will have the ability to post topics, receive our newsletter, use the advanced search, subscribe to threads and access many other special features. Personal Open source Business Explore Sign up Sign in Pricing Blog Support Search GitHub This repository Watch 42 Star 534 Fork 89 ruslo/hunter Code Issues 146 Pull requests 4 Projects Fatal Error No Such File Or Directory Code Blocks current community chat Stack Overflow Meta Stack Overflow your communities Sign up or log in to customize your list.

Looking at the jamfile it seems like the previously used create-library rule had all the handling for that while the new ac.check-library probably isn't even aware of these parameters. I can count on one hand the number of applications I've built from source over the past year. patchwork patch tracking system | about patchwork http://bashprofile.net/no-such/qapplication-no-such-file-or-directory-qt5.html Or maybe I'm just completely misunderstanding it which is always possible.

Excerpt of the package description: This metapackage provides the complete Boost development environment, including all separately-packaged libraries. LinuxQuestions.org > Forums > Linux Forums > Linux - Newbie [SOLVED] Failed to build boost 1.41.0 User Name Remember Me? gcc.compile.c++ bin.v2/libs/random/build/gcc-4.4.3/release/threading-multi/random_device.o First off, why so many errors? Installing boost_1.41 : # yum install boost141-devel "boost141" is in the EPEL repo https://fedoraproject.org/wiki/EPEL > > http://dl.fedoraproject.org/pub/epel...5-4.noarch.rpm > # rpm -Uvh epel-release-5-4.noarch.rpm . 1 members found this post helpful.

How about just : _

Removing elements from an array that are in another array How to tell why macOS thinks that a certificate is revoked? Looking at the jamfile it seems like the previously used create-library rule had all the handling for that while the new ac.check-library probably isn't even aware of these parameters. gcc.compile.c++ bin.v2/libs/iostreams/build/gcc-4.4.3/release/threading-multi/file_descriptor.o gcc.compile.c++ bin.v2/libs/iostreams/build/gcc-4.4.3/release/threading-multi/mapped_file.o gcc.compile.c++ bin.v2/libs/iostreams/build/gcc-4.4.3/release/threading-multi/zlib.o gcc.compile.c++ bin.v2/libs/iostreams/build/gcc-4.4.3/release/threading-multi/gzip.o gcc.compile.c++ bin.v2/libs/iostreams/build/gcc-4.4.3/release/threading-multi/bzip2.o libs/iostreams/src/bzip2.cpp:20:56: error: bzlib.h: No such file or directory libs/iostreams/src/bzip2.cpp:31: error: ‘BZ_OK’ was not declared in this scope libs/iostreams/src/bzip2.cpp:32: error: ‘BZ_RUN_OK’ was Join Date Jul 2007 Location Magic City of the Plains BeansHidden!

ruslo changed the title from Boost iostreams requires libbz2 which is not currently part of Hunter to Forward CMake arguments to Boost b2 build Apr 26, 2015 aadityakalsi commented Apr 26, note: Please refer to the Boost.Regex documentation for more information note: this is a strictly optional feature. ...patience... ...patience... ...found 16181 targets... ...updating 4 targets... In any case the documentation doesn't seem to properly reflect the current library behavior.