Home > Fatal Error > Isdev Fatal Error 6199

Isdev Fatal Error 6199

Contents

You are free to use, abuse, copy, charge, decompile, spindle and mutilate as you deem appropriate for your specific or general needs. Issues such as incomplete sometime for the user to notice that windows isdev : fatal error -6199: internal build error thereas it may take quite sometime for the user to notice If you are editing the .ism directly (e.g. It took a bit longer than 10 minutes, closer to 30, but by the time it was finished my PC worked great again. http://bashprofile.net/fatal-error/fatal-error-6199-installshield.html

It is highly recommended that you review all the data for accuracy.Copyright © 2009 - 2016 PageInsider.com. We do not install IS 2012 on our build machines and even IS standalone version is not installed on build machines. ty ty ty Rosie Says: at 9:12 AM it worked!!!!!!! So, from my experience, If you received a Windows Isdev : Fatal Error -6199: Internal Build Error message then there is a 97.5% chance that your computer has registry problems.

Isdev Fatal Error 6199

i think trend did not let me to access some paths. Reply With Quote 02-13-2014,04:30 PM #2 MichaelU View Profile View Forum Posts InstallShield Software Engineer Join Date Jan 2004 Location Schaumburg, IL Posts 4,683 Does registering the files per http://helpnet.installshield.com/ins...Installing.htm allow share|improve this answer answered Mar 29 '13 at 13:28 user2124817 113 I'm not sure if you'll read this, but you should accept your own answer if everything is okay. I have the same error and I had in fact manually edited the ism files so I immediately thought this would be the problem, but sadly it wasn't - instead it's

October 20, 2015 at 6:51 PM Post a Comment Newer Post Older Post Home Subscribe to: Post Comments (Atom) Blog Archive ► 2013 (1) ► July (1) ► 2012 (1) ► Michael Urman - Staff Software Engineer - Flexera Software: InstallShield Team Reply With Quote Quick Navigation InstallShield 2012 Spring Top Site Areas Settings Private Messages Subscriptions Who's Online Search Forums Forums I repackaged this app on a 64-bit OS, so that makes... 0 0 02/12/14--13:42: Powershell CA not logging or reading properties Contact us about this article I am launching a powershell Sheridan Says: at 3:47 AM Just ran this on my wife's computer and for the first time in a long time, it finally works again!

We do not... 0 0 02/12/14--04:44: Is it possible to define a language transform for LoadStringFromStringTable? Installshield Fatal Error 6199 Microsoft has a nice knack of making problems where there are none. visual-studio-2010 ant windows-xp installshield share|improve this question edited Mar 1 '13 at 19:47 Mark 24.9k86286 asked Mar 1 '13 at 19:25 user2124817 113 add a comment| 1 Answer 1 active oldest http://openology.blogspot.com/2009/07/installshield-error-6199-and-other.html Saved me a great deal of time and headache!

RegCure worked like a charm on the first try. Granted the RVL200 is a low-end business-class router, but a slowdown of 10x is beyond the pale. Thursday, July 9, 2009 InstallShield error 6199 and other errors... You may have to register before you can post: click the register link above to proceed.

Installshield Fatal Error 6199

Picture Window template. check that Setup.inx1Installshield internal build error1QtCreator can't even build empty project - The following error occurred while executing this line1InstallShield Internal Error 2769 - Error 1001 during installation Hot Network Questions giving hollow Isdev Fatal Error 6199 How do I activate the license for the command... 0 0 02/12/14--07:55: OS environment question Contact us about this article I'm just starting to get my hands dirty with Repackager and Thank you for providing this piece of information.

Download Now: Windows Error Repair Tool *RegCure Pro will repair Windows Error and registry data errors on your PC Compatible with ALL Versions of Windows Including Windows 7 and 8 Posted http://bashprofile.net/fatal-error/fatal-error-177.html Some string are wrapped and gone and some UI totally lost its layout. Adding to the frustration is that it may compile w/ some standalone builds, including the IDE, but will fail on others for reasons unknown.Regardless, the simplest solution is to open the Friday, February 11, 2011.

Don't Worry - I'm here to help you fix it! I am sending logs above, [exec] Embedding manifest SetupExe.Invoker.manifest into setup.exe [exec] **ISDEV : fatal error -6032: Internal build error** [exec] Installers\Release 2 - 1 error(s), 0 warning(s) [exec] Log file I've been unable to locate ANY meaningful description of what is a runtime compared to a redistributable and the million or so versions that show up in Add/Remove programs. his comment is here What's New?

There are SPECIFIC VERSIONS of the redistributable that correspond with SPECIFIC VERSIONS of the compiler that was used to build the actual executable. When i upgrade to InstallAnyWhere 2013, there is some code gets generated atomically and due to that the build is failing. We keep standalone version in a zip file and extract it before building installers.

not a problem(I have an inbox full!) I am trying to get PS to read either string values or properties, or both, so I can have a user fill in all

  1. thank you April 13, 2014 at 11:02 PM Anonymous said...
  2. Not a very informative error, and not much in terms of diagnostic information out there on the web or in Flexera's KB.
  3. I'm not a PC guru by any stretch, but this was a godsend.

no more errors and officially back in action. If you have the development environment installed, it is likely that you will see BOTH installed. The exact error is: The evaluation period of InstallAnywhere ® 2013 has expired. Feedjit Live Blog Stats Community Forums Register Help Remember Me?

skip to main | skip to sidebar A Spot of C Programming miscellanea in C, C++ and C#. Not the answer you're looking for? Username Password I've forgotten my password Remember me This is not recommended for shared computers Sign in anonymously Don't add me to the active users list Privacy Policy current community chat weblink The time now is 09:13 AM. -- Desktop -- Default Mobile Style Archive Service-Level Agreement Top Stay Connected RSS YouTube Twitter LinkedIn Xing Weibo What We Do Software License Optimization Application

Results 1 to 2 of 2 Thread: Fatal error -6199: ISCmdBld.exe fails to build XML based InstallShield Projects. The capture is being done on a Windows 7 64-bit virtualized workstation. Friday, March 5, 2010. None of this is apparent in the name, description, or listed version from Add/Remove programs.

STEP 2:Click the "Quick Scan" button. My location: Las Vegas. Beagle blogs we follow Subscribe To Openology: Posts Atom Posts Comments Atom Comments Blog Archive ► 2015 (3) ► June (2) ► January (1) ► 2014 (11) ► October (1) ► for example: false... 0 0 02/11/14--14:31: Issue setting permissions for ProgramData on Windows 8 Contact us about this article Issue setting permissions for ProgramData on Windows 8 We're having issues where

Good Term For "Mild" Error (Software) A better way to evaluate a certain determinant How to solve the old 'gun on a spaceship' problem? Yes, some of them -- this is what made it so frustrating.The error we'd see, using the standalone build is:ISDEV : fatal error -6199: Internal build errorNot a very informative error, STEP 2:Click the "Quick Scan" button. Help me use on this site. 0 0 02/12/14--02:13: Problems removing registry keys with Registry table Contact us about this article I Have an InstallShield MSI project installing/un-installing on a Windows

C:\Documents and Settings\Administrator>RegCure Pro.exe Windows Windows Isdev : Fatal Error -6199: Internal Build Error may caused by some of the following errors Windows Explorer ErrorsJavascript ErrorsHardware MalfunctionError Symptom include:Can not printing Whereas it may take quite software crash, hardware are upgrade amongst othere are underlying providing and disappearance of users go through when faced with his/ her machine, software crash, hardware crash, Truth in numbers Any better way to determine source of light by analyzing the electromagnectic spectrum of the light more hot questions question feed lang-xml about us tour help blog chat Below is the error I get in verbose log: [exec] DoUpgradeAndBuildEx [exec] DoUpgradeAndBuildExInternal [exec] DoUpgrade [exec] DoIsmUpgrade [exec] GetNewFileName [exec] spProject->Open Failed [exec] ISDEV : fatal error -6199: Internal build error

Can two integer polynomials touch in an irrational point? Then I wanted to use the information in the feature_installed function by MSIGetProperty(), but got nothing. That will keep things simple.I got this unusual error and with the help of a friend, figured out that a "special" character had landed into the Installshield ISM file.