Home > Fatal Error > Fatal Error No Such File Or Directory C++

Fatal Error No Such File Or Directory C++

Contents

Reply Saeid Yazdani 07-07-2016 at 20:31 Thats file is part of ‘libv4l-dev' package. That command does not remove all packages of course, rather the packages that have something to do with opencv. I dont know where to start…but make sure you have a recent version of GCC (e.g. 4.8 and higher), you have CMAKE version 3 or higher, you have installed the required When are you going to upload tut on using OpenCV in conjunction with QtQuick on Linux! this contact form

To do so: /opt/opencv/release$ make /opt/opencv/release$ sudo make install 12 /opt/opencv/release$ make/opt/opencv/release$ sudo make install That's all folks! But then when I went back to the /opt/opencv/release folder to run make, the same error "make: /usr/bin/cmake: Command not found" happened. I follow every step in your article, but I'm getting some error in "make" command: In file included from /usr/include/hdf5.h:27:0, from /home/vincentee/opencv_contrib/modules/hdf/include/opencv2/hdf/hdf5.hpp:40, from /home/vincentee/opencv_contrib/modules/hdf/include/opencv2/hdf.hpp:38, from /home/vincentee/opencv/release/modules/hdf/precomp.hpp:42: /usr/include/H5Dpublic.h:145:14: note: declared here H5_DLL Reply alik 22-02-2016 at 17:48 hi thank you for your post so useful i have problem with making opencv to work with netbeans no matters what project properties i set i http://askubuntu.com/questions/258648/libavformat-avformat-h-no-such-file-or-directory-while-compiling-opencv-for-a

Fatal Error No Such File Or Directory C++

so this didn't unfortunately fix the problem, so something else is amiss –Levon Mar 6 at 20:55 add a comment| up vote 0 down vote I'm getting the exact same problem. asked 8 months ago viewed 1663 times active 1 month ago Visit Chat Get the weekly newsletter! Reply Saeid Yazdani 17-01-2016 at 23:44 Glad it helped! If you would like to try out my cheat sheet.

  • Saeid Yazdani 01-03-2016 at 17:50 You need GCC 4.8 or higher.
  • thanks for the tutorial.
  • Feel free to change the base directory to wherever you want (granted that you have write access) but make sure to reflect the changes in the code snippets below!.

Your build parameters need modification as I've written above.FranciscoD_( 2013-09-06 01:09:22 +0000 )edit 0 answered 2013-09-05 17:17:36 +0000 nonamedotc 1739 ●2 ●15 ●44 updated 2013-09-05 17:19:49 +0000 I suspect you need Also make sure you are in the right folder when executing the cmake command. but i can't guarantee anything because i never worked with this lib Adv Reply October 19th, 2006 #7 Jason_Hampson View Profile View Forum Posts Private Message First Cup of Ubuntu Fatal Error No Such File Or Directory Gcc Once you set this switch to off, CMake should run without a problem" share|improve this answer edited Sep 12 at 8:02 Bex 1,8621025 answered Sep 10 at 14:20 Disha M 1

Bookmark. please help Reply Saeid Yazdani 07-09-2016 at 09:59 So what does the log file says? I also tried building either debug and release version of the program and it didn't work… Any idea what may be wrong? https://github.com/opencv/opencv_contrib/issues/661 Required fields are marked *CommentName* Email* Website Categories Articles Embedded Projects Image Processing Linux Machine Learning Miscellaneous Programming languages c/c++ Notes & Blogs Donate!

I take no responsibility! 🙂 $ sudo find / -name "*opencv*" -exec rm -i {} \; $ sudo ldconfig && sudo ldconfig -vp 12 $ sudo find / -name "*opencv*" -exec Fatal Error No Such File Or Directory Iostream Hope I helped. Top phillean Posts: 32 Joined: Thu Aug 28, 2008 7:49 pm Location: Canberra, Australia Re: Can't find avformat.h on build Quote Postby phillean » Fri Sep 12, 2008 10:43 pm I How do I explain that this is a terrible idea?

Fatal Error No Such File Or Directory Codeblocks

Not the answer you're looking for? http://www.synfig.org/forums/viewtopic.php?t=215 hopefully if you have done everything right, your installation should be done by now! Fatal Error No Such File Or Directory C++ That should take care of the problem. Fatal Error No Such File Or Directory Compilation Terminated Join Date Jul 2006 Location Austria Beans 173 Re: c++ compile error you need the -I option for additional include directories Code: -I /usr/include/ffmpeg Adv Reply October 19th, 2006 #3

Any suggestions? weblink Or do I have to uninstall the current version. There is the CMakeError.log: ---------------------------------------------------- Determining if the system is big endian passed with the following output: Change Dir: /home/kauevestena/opt/opencv/release/CMakeFiles/CMakeTmp CMakeFiles/cmTryCompileExec3960062789.dir/CheckIncludeFile.c.o -c /home/kauevestena/opt/opencv/release/CMakeFiles/CMakeTmp/CheckIncludeFile.c /home/kauevestena/opt/opencv/release/CMakeFiles/CMakeTmp/CheckIncludeFile.c:1:29: fatal error: ffmpeg/avformat.h: No such file or Take a look on OpenCV Installation tutorials or on steps which we use to test OpenCV. Fatal Error No Such File Or Directory Arduino

Reply Liz Olson 24-06-2016 at 02:03 Okay I removed my 2.8 version and followed your tutorial step by step. Reply najib 30-05-2016 at 14:01 [email protected]:/opt$ sudo git clone https://github.com/Itseez/opencv.git Cloning into ‘opencv'… fatal: unable to access ‘https://github.com/Itseez/opencv.git/': Failed to connect to github.com port 443: Connection timed out Reply Saeid Yazdani One point though. navigate here So, if the headers are located in /usr/share/include/xxx/yyy, the include statement should be #include .

After doing this, everything got uninstalled: gazebo, rviz, my husky package and other packages installed with Sudo. Fatal Error No Such File Or Directory Code Blocks Which day of the week is today? See also "/home/foong/opencv/release/CMakeFiles/CMakeOutput.log".

Use the 30 daily voting points that you get!

Reply Oziel Barbino 14-06-2016 at 19:08 oi amigo,não consigo resolver esse problema …. [ 7%] Building CXX object modules/core/CMakeFiles/opencv_core.dir/src/va_intel.cpp.o [ 8%] Building CXX object modules/core/CMakeFiles/opencv_core.dir/opencl_kernels_core.cpp.o make[2]: *** Sem regra para processar Reply Thiepaan Nayagam 14-03-2016 at 02:43 Hi, i followed this steps:- mkdir build && cd build && cmake -DCMAKE_INSTALL_PREFIX=/usr \ -DWITH_XINE=ON \ -DBUILD_TESTS=OFF \ -Wno-dev .. Make sure that the file exist in the suggested path and make sure your disk has not any problems. Fatal Error Python.h No Such File Or Directory Already have an account?

Thank you very much! The only thing you need to do is to call "make" command in release folder, wait for compilation (it might take up to one hour depending on your computer's processing power!) I had CUDA installed on my system and I think by default cmake compiles for CUDA. his comment is here Join them; it only takes a minute: Sign up Here's how it works: Anybody can ask a question Anybody can answer The best answers are voted up and rise to the

by looking in the error log I see the following "fatal errors": 1) /home/icey/opt/opencv/release/CMakeFiles/CMakeTmp/CheckIncludeFile.c:1:25: fatal error: sys/videoio.h: No such file or directory 2) /home/icey/opt/opencv/release/CMakeFiles/CMakeTmp/CheckIncludeFile.c:1:29: fatal error: ffmpeg/avformat.h: No such file or Not the answer you're looking for? I am also not sure if it should be inside /sys fodler!! Any advice?

Reply Saeid Yazdani 13-02-2016 at 16:55 good job 😛 Reply Waqar 13-02-2016 at 14:36 Hi!! Is there anyone could fix it? What is the difference between i2pd and Kovri? See also "/home/foong/opencv/release/CMakeFiles/CMakeError.log".

Success! And as I emphasized in the article make sure the double dot at the end of cmake command is present, or instead of double dot, write the actual physical path. Ask Ubuntu works best with JavaScript enabled UbuntuCommunityAsk!DeveloperDesignDiscourseHardwareInsightsJujuShopMore ›AppsHelpForumLaunchpadMAASCanonical current community chat Ask Ubuntu Ask Ubuntu Meta your communities Sign up or log in to customize your list. Reply Abate Demey 03-03-2016 at 23:29 On closer inspection: on the last command of the pre-build configuration I have an error.

Question Tools Follow subscribe to rss feed Stats Asked: 2013-09-05 13:35:12 +0000 Seen: 11,535 times Last updated: Nov 24 '13 Related questions fedora 19 not able to recognize AC2791 dongle. you do not need to check out 3.1.0…the code snippets are just here for example! Could you please tell me what is problem? Reply Saeid Yazdani 13-05-2016 at 11:05 what is written in the error log files?

When running make (in the "Make and Install" section of the tutorial) I get the message "fatal error: hdf5.h: No such file or directory". Please make sure you have a recent version of GCC (I recommend 4.8.X or higher) You did not install all the required packages! Required packages were listed in the article, again:
sudo apt-get install cmake git libgtk2.0-dev pkg-config libavcodec-dev libavformat-dev libswscale-dev Cansen 29-02-2016 at 11:40 Dear Saeid, Thank you very much for