Home > Error Code > Google Play Store Error Code

Google Play Store Error Code

Contents

Inside, 13 ColdFusion experts provide highly detailed, advanced instruction that will save you countless headaches and let you squeeze every last drop of functionality from the newest release. Invalid row/field data.   2221 Database: [2]. I doubt that was the case when I originally ran into this issue, but I've changed my setup so much, I can't exactly verify that there wasn't some unrecognized problem preventing This action should be sequenced after the costing actions. 2732 Directory Manager not initialized. have a peek here

This error occurs when values in the connection string contain unquoted semicolons, such as the InitialCatalog property.0xC002410A-1073594102DTS_E_LOGPROVIDERVALIDATIONFAILEDValidation of one or more log providers failed. A variable may only be added once to either the read lock list or the write lock list.0xC0014054-1073659820DTS_E_LOCKVARIABLEFORREADFailed to lock variable "%1" for read access with error 0x%2!8.8X! "%3".0xC0014055-1073659819DTS_E_LOCKVARIABLEFORWRITEFailed to lock Error 919: Your Access Point Name settings aren’t correct (how to configure APN settings What are APN Settings and How Can They Fix Data Issues on Your Prepaid Phone? Repeated table '[3]' in SQL query: [4].   2231 Database: [2].

Google Play Store Error Code

Invalid or missing query string: [3].   2238 Database: [2]. Novell makes no explicit or implied claims to the validity of this information. Databases are the same. A standard action or custom action made a call to a function requiring the directory manager before the initialization of the directory manager.

  • So what does this code indicate?
  • For more information, see Using Windows Installer and Windows Resource Protection.
  • The execute method should not be called on it.   2854 On the dialog [2] the control [3] is designated as first active control, but there is no such control.  
  • When trouble-shooting the DLL you may need to use one or more of the tools described in KB198038. 2739 Could not access JScript run time for custom action [2].
  • If you do not see your error in the list, the error was raised by a component outside Integration Services.
  • Data access failed, out of memory.   2203 Database: [2].
  • Available beginning with Windows Installer version 3.0   Community content may be also be available for some Windows Installer error messages.
  • The package does not execute when a log provider fails validation.0xC002410B-1073594101DTS_E_INVALIDVALUEINARRAYInvalid value in array.0xC002410C-1073594100DTS_E_ENUMERATIONELEMENTNOTENUMERABLEAn element of the enumerator returned by the ForEach Enumerator does not implement IEnumerator, contradicting the CollectionEnumerator property

No action is taken.   2802 No publisher is found for the event [2].   2803 Dialog View did not find a record for the dialog [2].   2804 On activation Column '[3]' repeated.   2243 Database: [2]. Clear the Google Play Store data If cleaning the cache of the Google Play Store and Google Play Services doesn't resolve the issue, try clearing the Google Play Store data: Open Google Play Error Code 18 MSXML may not be registered.0xC001100D-1073672179DTS_E_CANNOTLOADOLDPACKAGESThe package cannot be loaded.

Please, insert one and click Retry, or click Cancel to go back to the previously selected volume.   1804 There is no disk in drive [2]. Google Play Error Code 505 This error happens when a component or task attempts to create a variable with a namespace of "System".0xC001000E-1073676274DTS_E_CONNECTIONNOTFOUNDThe connection "%1" is not found. This error happens when a read-only attribute for a variable is being changed at runtime. https://support.office.com/en-us/article/Resolve-app-installation-errors-in-Google-Play-Store-abb73967-1758-497b-a6cd-27ef4094e7e3 There must be a Boolean evaluation expression in the For Loop.0xC001F186-1073614458DTS_E_EXPREVALASSIGNMENTTYPEMISMATCHThe result of the assignment expression "%1" cannot be converted to a type that is compatible with the variable that it

I advise using Titanium Backup, or a similar backup Don't Lose Your Data: 5 Top Backup Solutions For Android Don't Lose Your Data: 5 Top Backup Solutions For Android Our lives Google Play Store Error Code 18 How is the Heartbleed exploit even possible? Enter to win a Azulle Byte Plus! Verify the login credentials.0xC0016006-1073651706DTS_E_INVALIDSERVERNAMEThe server name specified in the URL %1 cannot be resolved.0xC0016007-1073651705DTS_E_PROXYAUTHProxy authentication failed.

Google Play Error Code 505

to variable "%2" cannot be applied.0xC001C013-1073627117DTS_E_OBJECTNOTINFOREACHLOOPFailure when adding an object to a ForEachPropertyMapping that is not a direct child of the ForEachLoop container.0xC001F001-1073614847DTS_E_FAILEDSYSTEMVARIABLEREMOVEFailed to remove a system variable. https://support.microsoft.com/en-us/kb/2615139 This happens when a configuration value cannot be converted from a string to the appropriate destination type. Google Play Store Error Code share|improve this answer edited Mar 9 '15 at 17:27 Stephen Ostermiller♦ 51.2k960170 answered Mar 9 '15 at 14:17 przemelek 562 add a comment| Did you find this question interesting? Play Store Error Code 504 Your coding project that you’ve been working on for the...

A lock cannot be acquired after 16 attempts. navigate here Invalid Installer transform format.   2247 Database: [2] Transform stream read/write failure.   2248 Database: [2] GenerateTransform/Merge: Column type in base table does not match reference table. This happens when loading a package and the file cannot be opened or loaded correctly into the XML document. Go to the Search the Support Knowledge Base page and use the tool provided there to perform a search for a specific Windows Installer error message. Google Play Error - 18

Just wait until it finishes updating. Catalog: [2], Error: [3]. And what about "double-click"? (Somewhat) generalised mean value theorem In the United States is racial, ethnic, or national preference an acceptable hiring practice for departments or companies in some situations? Check This Out System error: [3].   2267 Could not delete storage [2].

Logical fallacy: X is bad, Y is worse, thus X is not bad Good Term For "Mild" Error (Software) Is the NHS wrong about passwords? Google Play Error Code 20 This article does not cover modified devices (what’s a custom ROM? while preparing to load the package. %2.0xC0024102-1073594110DTS_E_TASKVALIDATIONFAILEDThe Validate method on the task failed, and returned error code 0x%1!8.8X! (%2).

Reply Theresa May 29, 2016 at 11:06 pm Thank you for your advice on fixing play store.

The file may be read only.0xC0012023-1073668061DTS_E_FAILPACKAGEONFAILURENAFailPackageOnFailure property is not applicable to the package container.0xC0012024-1073668060DTS_E_TASKPRODUCTLEVELThe task "%1" cannot run on installed %2 of Integration Services. Ads by Google These fixes cover the majority of Play Store problems. more stack exchange communities company blog Stack Exchange Inbox Reputation and Badges sign up log in tour help Tour Start here for a quick overview of the site Help Center Detailed Failed To Cache The Downloaded Installer Error 0x80070005 However, I’ll briefly mention why custom ROMs and rooting cause Google Play failures toward the end of this article.

Verify that the name is correct.0xC001F080-1073614720DTS_E_COULDNOTREPLACECHECKPOINTFILECannot replace the existing checkpoint file with the updated checkpoint file. and %2!d!.0xC001602E-1073651666DTS_E_FTPCREATEFOLDERCreating folder "%1" ... %2.0xC001602F-1073651665DTS_E_FTPDELETEFOLDERDeleting folder "%1" ... %2.0xC0016030-1073651664DTS_E_FTPCHANGEFOLDERChanging current directory to "%1". %2.0xC0016031-1073651663DTS_E_FTPFILESEMPTYNo files to transfer. Required fields are marked *Comment Name * Email * Kannon Yamada 267 articles A tech journalist (BA) with a background in international affairs (MA), Kannon's main interest is using technology to http://bashprofile.net/error-code/failed-to-connect-winsock-error-code-10060-win32-error-code-10060.html Most readers, however, will use various parts of this book at different times, depending on the constantly changing challenges faced by enterprise programmers.

Expected product version >= [4], found product version [5].   2751 Transform [2] invalid for package [3]. Accessing the same site externally works fine. For information, seeUsing Services Configuration. Reply Kannon Yamada August 22, 2016 at 5:29 pm What's really sad is that Android is probably today's most robust operating system.

Check the configuration value to ensure it can be converted to the type of the destination property or variable.0xC0012049-1073668023DTS_E_CONFIGFAILEDConfiguration failure. GetLastError() returned: [3].   2901 Invalid parameter to operation [2]: Parameter [3].   2902 Operation [2] called out of sequence. Available beginning with Windows Installer for Windows Server 2003. 1937 An error occurred during the installation of assembly '[6]'. The package cannot execute.

Contact your support personnel or package vendor. A program run as part of the setup did not finish as expected. Reply Kannon Yamada August 22, 2016 at 5:24 pm Can you elaborate on the problems that you're having? This error happens when the client or a task assigns a runtime object to a variable value.0xC001000D-1073676275DTS_E_RESERVEDNAMESPACEError assigning namespace to the variable.